�S�����ƎҖ�,�S���w�̖���,�H����,�P��,�s���{��,�s,����,�i���ւ̑Ή�,�v���b�g�z�[���̐��@�@�@,�i������������Ă���v���b�g�z�[���̐�,�G���x�[�^�[�̐ݒu�,�P��,�ړ����~������ɓK�����Ă���G���x�[�^�[�̐ݒu�,�P��,�G�X�J���[�^�[�̐ݒu�,�P��,�ړ����~������ɓK�����Ă���G�X�J���[�^�[�̐ݒu�,�P��,���̑��̏��~�@�̐ݒu�,�P��,�X�ΘH�̐ݒu�ӏ���,�P��,�ړ����~������ɓK�����Ă���X�ΘH�̐ݒu�ӏ���,�P��,���o��Q�җU���p�u���b�N�̐ݒu�̗L��,�ē��ݔ��̐ݒu�̗L��,��Q�ґΉ��^�֏��̐ݒu�̗L��,��Q�ґΉ��^���D���̐ݒu�̗L��,��Q�ґΉ��^�����@�̐ݒu�̗L��,�Ԃ����g�p�҂̉~���ȏ�~���\�ȃv���b�g�z�[���̐�,�]���h�~�̂��߂̐ݔ��̐ݒu�̗L��,�ܓx,�o�x,�ꏊ���R�[�h
�D�y�s��ʋ�,����,��k,��,�k�C��,�D�y�s,�k��,��,1,1,2 ,��,2,��,2 ,��,,��,,��,1 ,�ӏ�,1,�ӏ�,��,��,��,��,��,1,��,43.10834,141.33848,00001B00000000030BD70E26D1DCFFC0
�D�y�s��ʋ�,�k34��,��k,��,�k�C��,�D�y�s,�k��,��,2,2,3 ,��,3,��,2 ,��,,��,,��,1 ,�ӏ�,1,�ӏ�,��,��,��,��,��,2,��,43.1001,141.34213,00001B00000000030BD679A6D21E7FC0
�D�y�s��ʋ�,�k24��,��k,��,�k�C��,�D�y�s,�k��,��,1,1,2 ,��,2,��,,��,,��,,��,,�ӏ�,,�ӏ�,��,��,��,��,��,1,��,43.08961,141.34482,00001B00000000030BD5BCA6D24EFFC0
�D�y�s��ʋ�,�k18��,��k,��,�k�C��,�D�y�s,�k��,��,2,2,2 ,��,2,��,,��,,��,,��,,�ӏ�,,�ӏ�,��,��,��,��,��,2,��,43.08165,141.34676,00001B00000000030BD52DA6D271FFC0
�D�y�s��ʋ�,�k12��,��k,��,�k�C��,�D�y�s,�k��,��,2,2,3 ,��,3,��,,��,,��,,��,1 ,�ӏ�,1,�ӏ�,��,��,��,��,��,2,��,43.0747,141.3485,00001B00000000030BD4B0A6D2917FC0
�D�y�s��ʋ�,�����ۂ�,��k�E���L,��,�k�C��,�D�y�s,������,��,2,2,3 ,��,3,��,7 ,��,,��,,��,2 ,�ӏ�,2,�ӏ�,��,��,��,��,��,2,��,43.06586,141.35066,00001B00000000030BD41126D2B7FFC0
�D�y�s��ʋ�,��������,��k,��,�k�C��,�D�y�s,������,��,2,2,3 ,��,3,��,5 ,��,,��,,��,1 ,�ӏ�,1,�ӏ�,��,��,��,��,��,2,��,43.0553,141.35337,00001B00000000030BD35326D2E8FFC0
�D�y�s��ʋ�,��������,��k,��,�k�C��,�D�y�s,������,��,2,2,3 ,��,3,��,4 ,��,,��,,��,,�ӏ�,,�ӏ�,��,��,��,��,��,2,��,43.04848,141.35505,00001B00000000030BD2D8A6D306FFC0
�D�y�s��ʋ�,�y����,��k,��,�k�C��,�D�y�s,������,��,2,2,3 ,��,3,��,,��,,��,,��,,�ӏ�,,�ӏ�,��,��,��,��,��,2,��,43.04022,141.35584,00001B00000000030BD243A6D3157FC0
�D�y�s��ʋ�,���̓�,��k,��,�k�C��,�D�y�s,�L����,��,2,2,2 ,��,2,��,,��,,��,,��,,�ӏ�,,�ӏ�,��,��,��,��,��,2,��,43.03745,141.3612,00001B00000000030BD21226D375FFC0
�D�y�s��ʋ�,����,��k,��,�k�C��,�D�y�s,�L����,��,2,2,2 ,��,2,��,,��,,��,,��,,�ӏ�,,�ӏ�,��,��,��,��,��,2,��,43.03462,141.36837,00001B00000000030BD1DF26D3F6FFC0
�D�y�s��ʋ�,�약��,��k,��,�k�C��,�D�y�s,�L����,��,1,1,1 ,��,1,��,,��,,��,,��,1 ,�ӏ�,1,�ӏ�,��,��,��,��,��,1,��,43.02673,141.37136,00001B00000000030BD15126D42C7FC0
�D�y�s��ʋ�,����,��k,��,�k�C��,�D�y�s,���,,1,,1 ,��,,��,,��,,��,,��,2 ,�ӏ�,1,�ӏ�,��,��,��,��,��,1,��,43.01682,141.36736,00001B00000000030BD09EA6D3E47FC0
�D�y�s��ʋ�,���q���O,��k,��,�k�C��,�D�y�s,���,��,2,2,2 ,��,2,��,,��,,��,,��,1 ,�ӏ�,1,�ӏ�,��,��,��,��,��,2,��,43.00601,141.36492,00001B00000000030BCFDC26D3B8FFC0
�D�y�s��ʋ�,�^���,��k,��,�k�C��,�D�y�s,���,��,1,1,1 ,��,1,��,3 ,��,2,��,,��,,�ӏ�,,�ӏ�,��,��,��,��,��,1,��,42.99118,141.35854,00001B00000000030BCED126D345FFC0
�D�y�s��ʋ�,�{�̑�,����,��,�k�C��,�D�y�s,����,��,1,1,5 ,��,5,��,19 ,��,,��,,��,,�ӏ�,,�ӏ�,��,��,��,��,��,1,��,43.08953,141.27776,00001B00000000030BD5BBA6CD97FFC0
�D�y�s��ʋ�,������,����,��,�k�C��,�D�y�s,����,��,1,1,2 ,��,2,��,8 ,��,,��,,��,1 ,�ӏ�,1,�ӏ�,��,��,��,��,��,1,��,43.08153,141.29022,00001B00000000030BD52BA6CE77FFC0
�D�y�s��ʋ�,�Վ�,����,��,�k�C��,�D�y�s,����,��,1,1,2 ,��,2,��,5 ,��,,��,,��,,�ӏ�,,�ӏ�,��,��,��,��,��,1,��,43.07545,141.30444,00001B00000000030BD4BE26CF77FFC0
�D�y�s��ʋ�,��\�l��,����,��,�k�C��,�D�y�s,����,��,2,2,3 ,��,3,��,5 ,��,,��,,��,,�ӏ�,,�ӏ�,��,��,��,��,��,2,��,43.07045,141.31361,00001B00000000030BD46426D01CFFC0
�D�y�s��ʋ�,��28����,����,��,�k�C��,�D�y�s,������,��,2,2,2 ,��,2,��,2 ,��,,��,,��,1 ,�ӏ�,,�ӏ�,��,��,��,��,��,2,��,43.06097,141.31456,00001B00000000030BD3B926D02E7FC0
�D�y�s��ʋ�,�~�R����,����,��,�k�C��,�D�y�s,������,��,2,2,3 ,��,3,��,3 ,��,,��,,��,1 ,�ӏ�,1,�ӏ�,��,��,��,��,��,2,��,43.05573,141.31952,00001B00000000030BD35B26D0877FC0
�D�y�s��ʋ�,��18����,����,��,�k�C��,�D�y�s,������,��,2,2,3 ,��,3,��,4 ,��,,��,,��,,�ӏ�,,�ӏ�,��,��,��,��,��,2,��,43.05724,141.33041,00001B00000000030BD37626D14B7FC0
�D�y�s��ʋ�,��11����,����,��,�k�C��,�D�y�s,������,,1,,2 ,��,1,��,2 ,��,,��,,��,,�ӏ�,,�ӏ�,��,��,��,��,��,1,��,43.05868,141.3414,00001B00000000030BD39026D2117FC0
�D�y�s��ʋ�,�޽�����O,����,��,�k�C��,�D�y�s,������,��,1,1,2 ,��,2,��,4 ,��,1,��,,��,2 ,�ӏ�,2,�ӏ�,��,��,��,��,��,1,��,43.06153,141.36193,00001B00000000030BD3C3A6D382FFC0
�D�y�s��ʋ�,�e��,����,��,�k�C��,�D�y�s,���΋�,��,2,2,3 ,��,3,��,4 ,��,,��,,��,1 ,�ӏ�,1,�ӏ�,��,��,��,��,��,2,��,43.05726,141.37276,00001B00000000030BD376A6D445FFC0
�D�y�s��ʋ�,���D�y,����,��,�k�C��,�D�y�s,���΋�,��,2,2,2 ,��,2,��,2 ,��,,��,1,��,,�ӏ�,,�ӏ�,��,��,��,��,��,2,��,43.05177,141.38474,00001B00000000030BD313A6D51D7FC0
�D�y�s��ʋ�,����,����,��,�k�C��,�D�y�s,���΋�,��,1,1,2 ,��,2,��,4 ,��,,��,,��,1 ,�ӏ�,1,�ӏ�,��,��,��,��,��,1,��,43.04635,141.3957,00001B00000000030BD2B226D5E2FFC0
�D�y�s��ʋ�,�싽�V����,����,��,�k�C��,�D�y�s,���΋�,��,2,2,3 ,��,3,��,6 ,��,,��,,��,,�ӏ�,,�ӏ�,��,��,��,��,��,2,��,43.04026,141.41097,00001B00000000030BD244A6D6F57FC0
�D�y�s��ʋ�,�싽13����,����,��,�k�C��,�D�y�s,���΋�,,2,,3 ,��,,��,5 ,��,,��,,��,,�ӏ�,,�ӏ�,��,��,��,��,��,2,��,43.03572,141.42297,00001B00000000030BD1F2A6D7CD7FC0
�D�y�s��ʋ�,�싽18����,����,��,�k�C��,�D�y�s,���΋�,��,2,2,3 ,��,3,��,4 ,��,,��,,��,,�ӏ�,,�ӏ�,��,��,��,��,��,2,��,43.03033,141.43517,00001B00000000030BD191A6D8A97FC0
�D�y�s��ʋ�,��J�n,����,��,�k�C��,�D�y�s,���ʋ�,��,2,2,3 ,��,3,��,6 ,��,,��,,��,,�ӏ�,,�ӏ�,��,��,��,��,��,2,��,43.02793,141.45315,00001B00000000030BD166A6D9ECFFC0
�D�y�s��ʋ�,�Ђ΂肪�u,����,��,�k�C��,�D�y�s,���ʋ�,��,2,2,3 ,��,3,��,5 ,��,,��,,��,,�ӏ�,,�ӏ�,��,��,��,��,��,2,��,43.03211,141.46447,00001B00000000030BD1B1A6DAB87FC0
�D�y�s��ʋ�,�V�����ۂ�,����,��,�k�C��,�D�y�s,���ʋ�,��,1,1,2 ,��,2,��,7 ,��,,��,,��,2 ,�ӏ�,2,�ӏ�,��,��,��,��,��,1,��,43.03893,141.47402,00001B00000000030BD22CA6DB647FC0
�D�y�s��ʋ�,�h��,���L,��,�k�C��,�D�y�s,����,��,1,1,2 ,��,2,��,7 ,��,,��,,��,,�ӏ�,,�ӏ�,��,��,��,��,��,1,��,43.11302,141.36714,00001B00000000030BD76226D3E0FFC0
�D�y�s��ʋ�,�V����,���L,��,�k�C��,�D�y�s,����,��,2,2,3 ,��,3,��,9 ,��,,��,,��,3 ,�ӏ�,3,�ӏ�,��,��,��,��,��,2,��,43.10482,141.36915,00001B00000000030BD6CEA6D404FFC0
�D�y�s��ʋ�,����,���L,��,�k�C��,�D�y�s,����,��,1,1,2 ,��,2,��,6 ,��,,��,,��,1 ,�ӏ�,1,�ӏ�,��,��,��,��,��,1,��,43.09404,141.37178,00001B00000000030BD60CA6D4347FC0
�D�y�s��ʋ�,��ʓ�,���L,��,�k�C��,�D�y�s,����,��,2,2,3 ,��,3,��,6 ,��,,��,,��,2 ,�ӏ�,2,�ӏ�,��,��,��,��,��,2,��,43.08238,141.37443,00001B00000000030BD53AA6D463FFC0
�D�y�s��ʋ�,��������O,���L,��,�k�C��,�D�y�s,����,��,1,1,2 ,��,2,��,6 ,��,,��,,��,1 ,�ӏ�,1,�ӏ�,��,��,��,��,��,1,��,43.07822,141.36527,00001B00000000030BD4EFA6D3BEFFC0
�D�y�s��ʋ�,�k13��,���L,��,�k�C��,�D�y�s,����,��,2,2,3 ,��,3,��,4 ,��,,��,,��,,�ӏ�,,�ӏ�,��,��,��,��,��,2,��,43.07682,141.35494,00001B00000000030BD4D6A6D304FFC0
�D�y�s��ʋ�,���,��k�E�����E���L,��,�k�C��,�D�y�s,������,��,5,5,6 ,��,6,��,31 ,��,,��,,��,1 ,�ӏ�,1,�ӏ�,��,��,��,��,��,5,��,43.06001,141.35215,00001B00000000030BD3A826D2D2FFC0
�D�y�s��ʋ�,�L����������,���L,��,�k�C��,�D�y�s,������,��,1,1,2 ,��,2,��,7 ,��,,��,,��,,�ӏ�,,�ӏ�,��,��,��,��,��,1,��,43.05409,141.35699,00001B00000000030BD33DA6D329FFC0
�D�y�s��ʋ�,�w���O,���L,��,�k�C��,�D�y�s,�L����,��,1,1,2 ,��,2,��,6 ,��,1,��,,��,,�ӏ�,,�ӏ�,��,��,��,��,��,1,��,43.04771,141.36896,00001B00000000030BD2CAA6D4017FC0
�D�y�s��ʋ�,�L������,���L,��,�k�C��,�D�y�s,�L����,��,1,1,2 ,��,2,��,8 ,��,1,��,,��,1 ,�ӏ�,1,�ӏ�,��,��,��,��,��,1,��,43.04211,141.37616,00001B00000000030BD265A6D482FFC0
�D�y�s��ʋ�,����,���L,��,�k�C��,�D�y�s,�L����,��,1,1,2 ,��,2,��,7 ,��,1,��,,��,,�ӏ�,,�ӏ�,��,��,��,��,��,1,��,43.03615,141.38579,00001B00000000030BD1FAA6D5307FC0
�D�y�s��ʋ�,��������,���L,��,�k�C��,�D�y�s,�L����,��,1,1,2 ,��,2,��,10 ,��,1,��,,��,,�ӏ�,,�ӏ�,��,��,��,��,��,1,��,43.02997,141.39671,00001B00000000030BD18B26D5F4FFC0
�D�y�s��ʋ�,���Z,���L,��,�k�C��,�D�y�s,�L����,��,1,1,4 ,��,4,��,13 ,��,,��,,��,,�ӏ�,,�ӏ�,��,��,��,��,��,1,��,43.02183,141.40289,00001B00000000030BD0F8A6D6647FC0
���s��ʋ�,�򒆉�,��k,��,�{�錧,���s,���,��,1,1,2 ,��,2,��,2 ,��,,��,,��,6 ,�ӏ�,6,�ӏ�,��,,��,��,��,1,��,38.32297,140.88066,00001B00000000030A869526B1ABFFC0
���s��ʋ�,������,��k,��,�{�錧,���s,���,��,1,1,2 ,��,2,��,1 ,��,,��,,��,,�ӏ�,,�ӏ�,��,,��,��,��,1,��,38.31294,140.88411,00001B00000000030A85E0A6B1E9FFC0
���s��ʋ�,����,��k,��,�{�錧,���s,���,��,1,1,1 ,��,1,��,1 ,��,,��,,��,1 ,�ӏ�,1,�ӏ�,��,,��,��,��,1,��,38.30315,140.88627,00001B00000000030A8530A6B210FFC0
���s��ʋ�,�����u,��k,��,�{�錧,���s,�t��,��,1,1,3 ,��,3,��,1 ,��,,��,,��,1 ,�ӏ�,1,�ӏ�,��,,��,��,��,1,��,38.29592,140.8837,00001B00000000030A84AEA6B1E2FFC0
���s��ʋ�,�䌴,��k,��,�{�錧,���s,�t��,��,1,1,2 ,��,2,��,4 ,��,,��,,��,1 ,�ӏ�,1,�ӏ�,��,,��,��,��,1,��,38.28827,140.87826,00001B00000000030A8424A6B180FFC0
���s��ʋ�,�k���,��k,��,�{�錧,���s,�t��,��,1,1,2 ,��,2,��,3 ,��,,��,,��,,�ӏ�,,�ӏ�,��,,��,��,��,1,��,38.28244,140.86883,00001B00000000030A83BBA6B0D6FFC0
���s��ʋ�,�k�l�Ԓ�,��k,��,�{�錧,���s,�t��,��,1,1,2 ,��,2,��,3 ,��,,��,,��,1 ,�ӏ�,1,�ӏ�,��,,��,��,��,1,��,38.2721,140.86911,00001B00000000030A8301A6B0DBFFC0
���s��ʋ�,���������,��k,��,�{�錧,���s,�t��,��,1,1,2 ,��,2,��,7 ,��,,��,,��,4 ,�ӏ�,4,�ӏ�,��,,��,��,��,1,��,38.26673,140.8712,00001B00000000030A82A126B101FFC0
���s��ʋ�,�L����,��k,��,�{�錧,���s,�t��,��,1,1,2 ,��,2,��,2 ,��,,��,,��,,�ӏ�,,�ӏ�,��,,��,��,��,1,��,38.26285,140.87563,00001B00000000030A825B26B1517FC0
���s��ʋ�,���,��k,��,�{�錧,���s,�t��,��,1,1,2 ,��,2,��,13 ,��,,��,,��,4 ,�ӏ�,1,�ӏ�,��,,��,��,��,1,��,38.2597,140.87992,00001B00000000030A8222A6B19EFFC0
���s��ʋ�,�܋�,��k,��,�{�錧,���s,��ы�,��,1,1,2 ,��,2,��,4 ,��,,��,1,��,3 ,�ӏ�,3,�ӏ�,��,,��,��,��,1,��,38.2518,140.8811,00001B00000000030A819426B1B3FFC0
���s��ʋ�,������,��k,��,�{�錧,���s,��ы�,��,1,1,2 ,��,2,��,2 ,��,,��,,��,1 ,�ӏ�,1,�ӏ�,��,,��,��,��,1,��,38.24738,140.88158,00001B00000000030A8144A6B1BC7FC0
���s��ʋ�,�͌���,��k,��,�{�錧,���s,��ы�,��,1,1,2 ,��,2,��,2 ,��,,��,,��,,�ӏ�,,�ӏ�,��,,��,��,��,1,��,38.24063,140.8878,00001B00000000030A80CB26B22C7FC0
���s��ʋ�,�����꒚��,��k,��,�{�錧,���s,������,��,1,1,2 ,��,2,��,3 ,��,,��,,��,,�ӏ�,,�ӏ�,��,,��,��,��,1,��,38.23429,140.88752,00001B00000000030A805926B2277FC0
���s��ʋ�,����,��k,��,�{�錧,���s,������,��,1,1,2 ,��,2,��,6 ,��,,��,,��,,�ӏ�,,�ӏ�,��,,��,��,��,1,��,38.22848,140.88478,00001B00000000030A7FF0A6B1F67FC0
���s��ʋ�,������,��k,��,�{�錧,���s,������,��,1,1,2 ,��,2,��,2 ,��,,��,,��,,�ӏ�,,�ӏ�,��,,��,��,��,1,��,38.22472,140.87699,00001B00000000030A7FACA6B169FFC0
���s��ʋ�,�x��,��k,��,�{�錧,���s,������,��,1,1,2 ,��,2,��,4 ,��,,��,,��,2 ,�ӏ�,2,�ӏ�,��,��,��,��,��,1,��,38.21415,140.8706,00001B00000000030A7EEEA6B0F6FFC0
�����n���S,��,���,��,�����s,�䓌��,,,2,1,1 ,��,1,��,2 ,��,,��,3,��,,�ӏ�,,�ӏ�,��,��,��,��,,,��,35.71075,139.79777,00001B000000000309CEE9A66587FFC0
�����n���S,�c����,���,��,�����s,�䓌��,,��,2,2,2 ,��,2,��,,��,,��,,��,,�ӏ�,,�ӏ�,��,,��,��,,,��,35.70992,139.79031,00001B000000000309CEDAA66501FFC0
�����n���S,��ג�,���,��,�����s,�䓌��,,,2,,,��,,��,,��,,��,3,��,,�ӏ�,,�ӏ�,��,,��,��,,,��,35.71139,139.78221,00001B000000000309CEF526646FFFC0
�����n���S,���,����A����J,��,�����s,�䓌��,,��,4,4,6 ,��,6,��,2 ,��,,��,,��,,�ӏ�,,�ӏ�,��,��,��,��,,,��,35.71184,139.77562,00001B000000000309CEFD2663F97FC0
�����n���S,���L���H,���,��,�����s,�䓌��,,,2,1,1 ,��,1,��,1 ,��,1,��,2,��,,�ӏ�,,�ӏ�,��,,��,��,��,,��,35.70777,139.77301,00001B000000000309CEB3A663CA7FC0
�����n���S,���L��,���,��,�����s,���c��,,,2,,,��,,��,,��,,��,5,��,,�ӏ�,,�ӏ�,��,,��,��,,,��,35.70278,139.77176,00001B000000000309CE5A2663B3FFC0
�����n���S,�_�c,���,��,�����s,���c��,,,1,,1 ,��,1,��,,��,,��,1,��,,�ӏ�,,�ӏ�,��,,�~,��,,,��,35.69371,139.77089,00001B000000000309CDB6A663A47FC0
�����n���S,�O�z�O,����A������,��,�����s,������,,,2,1,4 ,��,3,��,22 ,��,2,��,,��,2 ,�ӏ�,2,�ӏ�,��,,��,��,,,��,35.68717,139.77358,00001B000000000309CD412663D47FC0
�����n���S,���{��,����A����,��,�����s,������,,,3,2,3 ,��,3,��,10 ,��,,��,1,��,2 ,�ӏ�,2,�ӏ�,��,,��,��,,,��,35.68188,139.77334,00001B000000000309CCE1A663D07FC0
�����n���S,����,���,��,�����s,������,,,1,,1 ,��,,��,,��,,��,1,��,,�ӏ�,,�ӏ�,��,,��,��,,,��,35.67671,139.7701,00001B000000000309CC84A66395FFC0
�����n���S,���,����A�ۃm���A����J,��,�����s,������,,��,3,3,8 ,��,6,��,15 ,��,,��,,��,1 ,�ӏ�,1,�ӏ�,��,��,��,��,��,,��,35.6715,139.76537,00001B000000000309CC27266340FFC0
�����n���S,�V��,���,��,�����s,�`��,,��,2,2,3 ,��,3,��,2 ,��,1,��,,��,,�ӏ�,,�ӏ�,��,,��,��,,,��,35.66738,139.75851,00001B000000000309CBDCA662C57FC0
�����n���S,�Ճm��,���,��,�����s,�`��,,,2,1,1 ,��,1,��,,��,,��,1,��,,�ӏ�,,�ӏ�,��,��,�~,��,,,��,35.67016,139.75012,00001B000000000309CC0EA6622E7FC0
�����n���S,���r�R��,����A��k,��,�����s,�`��,,,2,,5 ,��,3,��,32 ,��,1,��,1,��,,�ӏ�,,�ӏ�,��,,��,��,��,,��,35.67151,139.74194,00001B000000000309CC2726619AFFC0
�����n���S,�ԍ〈��,����A�ۃm��,��,�����s,�`��,,��,2,2,5 ,��,4,��,8 ,��,,��,,��,,�ӏ�,,�ӏ�,��,��,��,��,,,��,35.67683,139.73733,00001B000000000309CC86A66147FFC0
�����n���S,�R�꒚��,����A������,��,�����s,�`��,,,3,2,3 ,��,3,��,3 ,��,,��,2,��,,�ӏ�,,�ӏ�,��,,��,��,,,��,35.67279,139.72414,00001B000000000309CC3E26605AFFC0
�����n���S,�O���O,���,��,�����s,�`��,,,2,,1 ,��,1,��,3 ,��,2,��,2,��,,�ӏ�,,�ӏ�,��,��,��,��,,,��,35.67038,139.71783,00001B000000000309CC12A65FE8FFC0
�����n���S,�\�Q��,����A���c�A������,��,�����s,�`��,,��,3,3,4 ,��,4,��,19 ,��,2,��,,��,1 ,�ӏ�,1,�ӏ�,��,��,��,��,,,��,35.66504,139.71248,00001B000000000309CBB2A65F88FFC0
�����n���S,�a�J,���,��,�����s,�a�J��,,,2,,,��,,��,2 ,��,,��,2,��,,�ӏ�,,�ӏ�,��,,�|,��,,,��,35.65878,139.70172,00001B000000000309CB42265EC6FFC0
�����n���S,�r��,�ۃm���A�L�y���A�@�@�@���s�S,��,�����s,�L����,,��,3,3,7 ,��,7,��,33 ,��,1,��,1,��,1 ,�ӏ�,1,�ӏ�,��,��,��,��,,,��,35.73036,139.71112,00001B000000000309D04A265F707FC0
�����n���S,�V���,�ۃm��,��,�����s,������,,��,2,2,2 ,��,2,��,3 ,��,,��,,��,,�ӏ�,,�ӏ�,��,,��,��,��,,��,35.72613,139.72936,00001B000000000309CFFE2660B87FC0
�����n���S,䪉גJ,�ۃm��,��,�����s,������,,��,2,2,2 ,��,2,��,2 ,��,,��,,��,2 ,�ӏ�,2,�ӏ�,��,��,��,��,,,��,35.7172,139.7369,00001B000000000309CF5DA661407FC0
�����n���S,��y��,�ۃm���A��k,��,�����s,������,,��,3,3,6 ,��,5,��,23 ,��,,��,,��,1 ,�ӏ�,1,�ӏ�,��,��,��,��,,,��,35.70731,139.75086,00001B000000000309CEABA6623B7FC0
�����n���S,�{���O����,�ۃm��,��,�����s,������,,��,2,2,2 ,��,2,��,4 ,��,,��,,��,,�ӏ�,,�ӏ�,��,��,��,��,��,,��,35.70674,139.76017,00001B000000000309CEA12662E37FC0
�����n���S,�䒃�m��,�ۃm��,��,�����s,������,,��,2,2,2 ,��,2,��,,��,,��,,��,,�ӏ�,,�ӏ�,��,,��,��,��,,��,35.70043,139.76441,00001B000000000309CE2FA6632F7FC0
�����n���S,�W�H��,�ۃm��,��,�����s,���c��,,,2,1,1 ,��,1,��,,��,,��,1,��,,�ӏ�,,�ӏ�,��,,�~,��,,,��,35.69487,139.76746,00001B000000000309CDCBA663667FC0
�����n���S,��蒬,�ۃm���A�����A���c�A������,��,�����s,���c��,,,5,3,9 ,��,5,��,49 ,��,4,��,5,��,,�ӏ�,,�ӏ�,��,��,��,��,,,��,35.68688,139.7662,00001B000000000309CD3BA6634FFFC0
�����n���S,����,�ۃm��,��,�����s,���c��,,��,1,1,3 ,��,1,��,3 ,��,,��,,��,,�ӏ�,,�ӏ�,��,,��,��,,,��,35.68194,139.7648,00001B000000000309CCE2A663367FC0
�����n���S,���P��,�ۃm���A����J�A�@�@���c,��,�����s,���c��,,��,4,4,6 ,��,6,��,22 ,��,,��,5,��,,�ӏ�,,�ӏ�,��,,��,��,,,��,35.67424,139.75268,00001B000000000309CC5826625C7FC0
�����n���S,����c�����O,�ۃm���A���c,��,�����s,���c��,,��,3,3,4 ,��,4,��,20 ,��,1,��,1,��,,�ӏ�,,�ӏ�,��,,��,��,��,,��,35.67487,139.74552,00001B000000000309CC63A661DB7FC0
�����n���S,�l�c�J,�ۃm���A��k,��,�����s,�V�h��,,,3,1,2 ,��,2,��,6 ,��,,��,2,��,,�ӏ�,,�ӏ�,��,,��,��,,,��,35.6842,139.73008,00001B000000000309CD0BA660C57FC0
�����n���S,�l�J�O����,�ۃm��,��,�����s,�V�h��,,,2,1,1 ,��,1,��,,��,,��,3,��,,�ӏ�,,�ӏ�,��,,��,��,,,��,35.68784,139.71933,00001B000000000309CD4D266003FFC0
�����n���S,�V�h�䉑�O,�ۃm��,��,�����s,�V�h��,,,2,1,1 ,��,1,��,,��,,��,2,��,,�ӏ�,,�ӏ�,��,��,��,��,,,��,35.68852,139.71092,00001B000000000309CD59265F6CFFC0
�����n���S,�V�h�O����,�ۃm���A���s�S,��,�����s,�V�h��,,��,2,2,9 ,��,9,��,22 ,��,,��,,��,,�ӏ�,,�ӏ�,��,��,��,��,��,,��,35.69118,139.70421,00001B000000000309CD89265EF3FFC0
�����n���S,�V�h,�ۃm��,��,�����s,�V�h��,,��,1,1,2 ,��,2,��,2 ,��,,��,,��,,�ӏ�,,�ӏ�,��,��,��,��,��,,��,35.69247,139.70055,00001B000000000309CDA0265EB1FFC0
�����n���S,���V�h,�ۃm��,��,�����s,�V�h��,,��,2,2,3 ,��,3,��,6 ,��,,��,,��,,�ӏ�,,�ӏ�,��,,��,��,,,��,35.69452,139.69256,00001B000000000309CDC5265E227FC0
�����n���S,������,�ۃm��,��,�����s,�����,,��,2,2,3 ,��,3,��,9 ,��,2,��,,��,,�ӏ�,,�ӏ�,��,��,��,��,,,��,35.69709,139.68221,00001B000000000309CDF3A65D67FFC0
�����n���S,�V����,�ۃm��,��,�����s,�����,,��,2,2,2 ,��,2,��,,��,,��,,��,,�ӏ�,,�ӏ�,��,��,��,��,��,,��,35.69747,139.66951,00001B000000000309CDFA265C837FC0
�����n���S,�����~��,�ۃm��,��,�����s,������,,��,2,2,2 ,��,2,��,,��,,��,,��,,�ӏ�,,�ӏ�,��,��,��,��,,,��,35.69797,139.6583,00001B000000000309CE03265BB97FC0
�����n���S,�V���~��,�ۃm��,��,�����s,������,,��,2,2,2 ,��,2,��,,��,,��,,��,,�ӏ�,,�ӏ�,��,��,��,��,,,��,35.69786,139.64851,00001B000000000309CE01265B097FC0
�����n���S,�숢���P�J,�ۃm��,��,�����s,������,,��,2,2,2 ,��,2,��,,��,,��,,��,,�ӏ�,,�ӏ�,��,,��,��,��,,��,35.69946,139.63557,00001B000000000309CE1E265A207FC0
�����n���S,���E,�ۃm��,��,�����s,������,,��,1,1,3 ,��,2,��,3 ,��,2,��,,��,,�ӏ�,,�ӏ�,��,��,��,��,��,,��,35.70417,139.61976,00001B000000000309CE73265903FFC0
�����n���S,����V��,�ۃm��,��,�����s,�����,,,2,,,��,,��,,��,,��,,��,,�ӏ�,,�ӏ�,��,,��,��,,,��,35.69167,139.67401,00001B000000000309CD92265CD47FC0
�����n���S,����x�m����,�ۃm��,��,�����s,�����,,��,2,2,2 ,��,2,��,,��,,��,,��,,�ӏ�,,�ӏ�,��,��,��,��,,,��,35.69082,139.66816,00001B000000000309CD82A65C6AFFC0
�����n���S,���쒬,�ۃm��,��,�����s,������,,,1,,,��,,��,,��,,��,2,��,,�ӏ�,,�ӏ�,��,,�~,��,,,��,35.68352,139.65794,00001B000000000309CCFF265BB2FFC0
�����n���S,���Z,����J,��,�����s,�r���,,��,2,2,2 ,��,2,��,4 ,��,,��,,��,,�ӏ�,,�ӏ�,��,,��,��,,,��,35.73231,139.79878,00001B000000000309D06DA6659A7FC0
�����n���S,�O�m��,����J,��,�����s,�䓌��,,��,2,2,4 ,��,4,��,,��,,��,5,��,,�ӏ�,,�ӏ�,��,��,��,��,,,��,35.72928,139.79117,00001B000000000309D0372665117FC0
�����n���S,���J,����J,��,�����s,�䓌��,,,2,1,1 ,��,1,��,2 ,��,,��,2,��,,�ӏ�,,�ӏ�,��,��,��,��,,,��,35.72056,139.78447,00001B000000000309CF9A2664987FC0
�����n���S,����k��,����J,��,�����s,�䓌��,,,1,,,��,,��,4 ,��,,��,2,��,,�ӏ�,,�ӏ�,��,,��,��,��,,��,35.70665,139.77619,00001B000000000309CE9FA664037FC0
�����n���S,�H�t��,����J,��,�����s,���c��,,��,2,2,3 ,��,3,��,4 ,��,,��,,��,,�ӏ�,,�ӏ�,��,,��,��,,,��,35.69797,139.77553,00001B000000000309CE032663F7FFC0
�����n���S,���`�n��,����J,��,�����s,������,,��,2,2,2 ,��,2,��,,��,,��,,��,,�ӏ�,,�ӏ�,��,��,��,��,,,��,35.69042,139.77876,00001B000000000309CD7BA66431FFC0
�����n���S,�l�`��,����J,��,�����s,������,,��,2,2,2 ,��,2,��,1 ,��,,��,,��,,�ӏ�,,�ӏ�,��,��,��,��,,,��,35.68626,139.78234,00001B000000000309CD30A664727FC0
�����n���S,���꒬,����J�A����,��,�����s,������,,��,3,3,2 ,��,2,��,5 ,��,,��,1,��,1 ,�ӏ�,1,�ӏ�,��,,��,��,,,��,35.67908,139.77962,00001B000000000309CCAF2664417FC0
�����n���S,�����x,����J,��,�����s,������,,��,1,1,1 ,��,1,��,1 ,��,,��,1,��,,�ӏ�,,�ӏ�,��,��,��,��,,,��,35.67537,139.77733,00001B000000000309CC6CA66417FFC0
�����n���S,�z�n,����J,��,�����s,������,,��,2,2,2 ,��,2,��,,��,,��,,��,,�ӏ�,,�ӏ�,��,,��,��,��,,��,35.66793,139.77247,00001B000000000309CBE6A663C07FC0
�����n���S,�����,����J,��,�����s,������,,��,1,1,2 ,��,2,��,4 ,��,,��,,��,,�ӏ�,,�ӏ�,��,,��,��,,,��,35.66913,139.76763,00001B000000000309CBFC2663697FC0
�����n���S,����J,����J�A���c,��,�����s,���c��,,,3,,4 ,��,3,��,8 ,��,,��,4,��,2 ,�ӏ�,2,�ӏ�,��,��,��,��,,,��,35.67427,139.7606,00001B000000000309CC58A662EAFFC0
�����n���S,�_�J��,����J,��,�����s,�`��,,,2,,2 ,��,2,��,4 ,��,,��,2,��,,�ӏ�,,�ӏ�,��,��,��,��,,,��,35.66262,139.74472,00001B000000000309CB872661CCFFC0
�����n���S,�Z�{��,����J,��,�����s,�`��,,��,2,2,3 ,��,3,��,8 ,��,2,��,1,��,,�ӏ�,,�ӏ�,��,��,��,��,��,,��,35.6628,139.73116,00001B000000000309CB8A2660D8FFC0
�����n���S,�L��,����J,��,�����s,�`��,,,2,,,��,,��,,��,,��,4,��,,�ӏ�,,�ӏ�,��,,�~,��,,,��,35.6515,139.72221,00001B000000000309CABF266037FFC0
�����n���S,�b���,����J,��,�����s,�a�J��,,��,2,2,3 ,��,3,��,4 ,��,,��,,��,,�ӏ�,,�ӏ�,��,��,��,��,,,��,35.64702,139.70873,00001B000000000309CA6E265F457FC0
�����n���S,����,����,��,�����s,�V�h��,,��,1,1,1 ,��,1,��,2 ,��,,��,1,��,,�ӏ�,,�ӏ�,��,��,��,��,��,,��,35.71064,139.68597,00001B000000000309CEE7A65DAB7FC0
�����n���S,���c�n��,����,��,�����s,�V�h��,,��,2,2,3 ,��,3,��,2 ,��,,��,,��,,�ӏ�,,�ӏ�,��,��,��,��,,,��,35.71328,139.70505,00001B000000000309CF17265F02FFC0
�����n���S,����c,����,��,�����s,�V�h��,,��,2,2,1 ,��,1,��,,��,,��,2,��,,�ӏ�,,�ӏ�,��,,��,��,��,,��,35.70568,139.72219,00001B000000000309CE8E2660377FC0
�����n���S,�_�y��,����,��,�����s,�V�h��,,,2,,,��,,��,1 ,��,,��,3,��,,�ӏ�,,�ӏ�,��,��,��,��,,,��,35.70387,139.73452,00001B000000000309CE6DA661157FC0
�����n���S,�ѓc��,�����A�L�y���A�@�@�@��k,��,�����s,���c��,,,4,3,5 ,��,5,��,22 ,��,3,��,1,��,5 ,�ӏ�,5,�ӏ�,��,��,��,��,,,��,35.70137,139.74651,00001B000000000309CE40A661ED7FC0
�����n���S,��i��,�����A������,��,�����s,���c��,,��,4,4,5 ,��,5,��,21 ,��,,��,,��,,�ӏ�,,�ӏ�,��,,��,��,,,��,35.6955,139.75112,00001B000000000309CDD72662407FC0
�����n���S,�|��,����,��,�����s,���c��,,,2,,,��,,��,1 ,��,,��,5,��,,�ӏ�,,�ӏ�,��,��,��,��,,,��,35.69044,139.75767,00001B000000000309CD7BA662B67FC0
�����n���S,��O����,����,��,�����s,�]����,,,2,1,3 ,��,2,��,3 ,��,3,��,,��,,�ӏ�,,�ӏ�,��,��,��,��,,,��,35.67189,139.7961,00001B000000000309CC2E266569FFC0
�����n���S,�؏�,����,��,�����s,�]����,,��,1,1,2 ,��,2,��,18 ,��,,��,,��,,�ӏ�,,�ӏ�,��,��,��,��,,,��,35.66936,139.80712,00001B000000000309CC002666307FC0
�����n���S,���z��,����,��,�����s,�]����,,��,2,2,3 ,��,3,��,6 ,��,3,��,,��,,�ӏ�,,�ӏ�,��,��,��,��,,,��,35.66959,139.81768,00001B000000000309CC04A666EE7FC0
�����n���S,�썻��,����,��,�����s,�]����,,��,1,1,3 ,��,2,��,4 ,��,1,��,,��,3 ,�ӏ�,3,�ӏ�,��,,��,��,,,��,35.66842,139.8317,00001B000000000309CBEFA667EAFFC0
�����n���S,������,����,��,�����s,�]�ː��,,��,2,2,3 ,��,3,��,8 ,��,,��,,��,,�ӏ�,,�ӏ�,��,,��,��,,,��,35.66456,139.8596,00001B000000000309CBAA2669E0FFC0
�����n���S,����,����,��,�����s,�]�ː��,,��,2,2,3 ,��,3,��,4 ,��,,��,,��,1 ,�ӏ�,1,�ӏ�,��,��,��,��,,,��,35.66362,139.87253,00001B000000000309CB99266AC9FFC0
�����n���S,�Y��,����,��,��t��,�Y���s,,��,2,2,2 ,��,2,��,4 ,��,,��,,��,,�ӏ�,,�ӏ�,��,��,��,��,��,,��,35.6659,139.89324,00001B000000000309CBC2266C3E7FC0
�����n���S,��s��,����,��,��t��,�s��s,,��,2,2,3 ,��,3,��,4 ,��,,��,,��,,�ӏ�,,�ӏ�,��,��,��,��,��,,��,35.67273,139.90228,00001B000000000309CC3D266CE17FC0
�����n���S,�s��,����,��,��t��,�s��s,,��,2,2,2 ,��,2,��,6 ,��,,��,,��,,�ӏ�,,�ӏ�,��,,��,��,,,��,35.68262,139.91419,00001B000000000309CCEF266DB77FC0
�����n���S,���T,����,��,��t��,�s��s,,��,2,2,2 ,��,2,��,6 ,��,,��,,��,,�ӏ�,,�ӏ�,��,��,��,��,,,��,35.69102,139.92428,00001B000000000309CD86266E6D7FC0
�����n���S,���ؒ��R,����,��,��t��,�D���s,,��,2,2,2 ,��,2,��,2 ,��,,��,,��,,�ӏ�,,�ӏ�,��,,��,��,,,��,35.7033,139.94191,00001B000000000309CE63266FAA7FC0
�����n���S,���D��,����,��,��t��,�D���s,,��,2,2,3 ,��,3,��,3 ,��,,��,,��,,�ӏ�,,�ӏ�,��,,��,��,��,,��,35.70727,139.95883,00001B000000000309CEAAA670DAFFC0
�����n���S,�k����,���c,��,�����s,������,,��,1,1,1 ,��,1,��,1 ,��,,��,,��,1 ,�ӏ�,1,�ӏ�,��,,��,��,,,��,35.77689,139.8321,00001B000000000309D3902667F1FFC0
�����n���S,����,���c,��,�����s,������,,��,2,2,2 ,��,2,��,4 ,��,2,��,,��,1 ,�ӏ�,1,�ӏ�,��,��,��,��,��,,��,35.76228,139.82489,00001B000000000309D2892667707FC0
�����n���S,�k��Z,���c,��,�����s,������,,��,1,1,3 ,��,2,��,5 ,��,,��,,��,1 ,�ӏ�,1,�ӏ�,��,��,��,��,��,,��,35.7492,139.8044,00001B000000000309D19DA665FF7FC0
�����n���S,����,���c,��,�����s,�r���,,��,2,2,2 ,��,2,��,4 ,��,1,��,,��,3 ,�ӏ�,3,�ӏ�,��,,��,��,,,��,35.74207,139.78005,00001B000000000309D11D266448FFC0
�����n���S,�����闢,���c,��,�����s,�r���,,��,2,2,2 ,��,2,��,8 ,��,,��,1,��,1 ,�ӏ�,1,�ӏ�,��,��,��,��,,,��,35.73236,139.76689,00001B000000000309D06E26635C7FC0
�����n���S,��ʖ�,���c,��,�����s,������,,��,2,2,,��,,��,2 ,��,,��,3,��,,�ӏ�,,�ӏ�,��,,��,��,,,��,35.72575,139.76331,00001B000000000309CFF7A6631BFFC0
�����n���S,����,���c,��,�����s,������,,��,2,2,2 ,��,2,��,2 ,��,,��,,��,,�ӏ�,,�ӏ�,��,��,��,��,,,��,35.71733,139.76575,00001B000000000309CF5FA66347FFC0